사용 방법
- 설치 명령을 복사하고 자신의 에이전트 환경에 설치하기 전에 소스 패키지를 확인하세요.
- 필요한 도구, 인증 정보, 지원 환경은 원본 문서에서 확인하세요.
- 입력과 원하는 산출물을 설명하고 출처와 결과를 대조하세요.
npx skills add https://github.com/fayazara/macos-app-skills --skill macos-build시작 전 확인
- 설치에는 모델 구독, API 한도, 파일 접근 권한이 포함되지 않습니다.
- 별점 수와 설치 수는 활동 지표이며 독립적인 품질·보안 검증이 아닙니다.
원본 저장소의 제목, 예시, 코드, 표, 링크, 이미지를 유지해 표시합니다.
Build macOS App
Build any native macOS Xcode project from the command line using xcodebuild.
Finding the Project
Before building, locate the Xcode project or workspace:
find . -maxdepth 2 -name "*.xcodeproj" -o -name "*.xcworkspace" | head -5Then list available schemes:
xcodebuild -list -project "YourApp.xcodeproj" 2>/dev/null | grep -A 20 "Schemes:"Build Command
Use this command template, replacing the project path and scheme:
DEVELOPER_DIR=/Applications/Xcode.app/Contents/Developer xcodebuild build \
-project "YourApp.xcodeproj" \
-scheme "YourApp" \
-configuration Debug \
-destination "platform=macOS" \
2>&1 | grep -E "(BUILD SUCCEEDED|BUILD FAILED|error:)" | head -20For workspaces (projects with SPM dependencies or CocoaPods):
DEVELOPER_DIR=/Applications/Xcode.app/Contents/Developer xcodebuild build \
-workspace "YourApp.xcworkspace" \
-scheme "YourApp" \
-configuration Debug \
-destination "platform=macOS" \
2>&1 | grep -E "(BUILD SUCCEEDED|BUILD FAILED|error:)" | head -20Interpreting Results
- BUILD SUCCEEDED -- the build passed, report success to the user.
- BUILD FAILED with
error:lines -- read each error, identify the source file and line, and help the user fix them. After fixing, re-run the build to verify. - If the output is empty or unclear, re-run without the grep filter to get full output for diagnosis.
When to Build
- After making code changes, if the user asks to verify they compile
- When the user explicitly says "build", "compile", or "check if it builds"
- After fixing build errors, to confirm the fix worked
Xcode Beta Toolchains
If the project targets a beta SDK (e.g., macOS 26 Tahoe), you may need to point to the beta Xcode:
DEVELOPER_DIR=/Applications/Xcode-beta.app/Contents/Developer xcodebuild build ...Check which Xcode is available:
ls /Applications/ | grep -i xcodeCommon Build Failures
| Error | Fix |
|---|---|
no such module 'Sparkle' | SPM dependency not resolved. Try xcodebuild -resolvePackageDependencies first |
no signing identity found | Set CODE_SIGN_IDENTITY="" and CODE_SIGNING_ALLOWED=NO for command-line builds |
SDK "macosx" cannot be located | Wrong DEVELOPER_DIR. Check Xcode installation path |
scheme not found | Run xcodebuild -list to see available schemes |



